Home > Failed To > Vmmon.ko Error 2

Vmmon.ko Error 2

Contents

Yuandan Zhang 张元旦 ..................................... Re: Workstation 12.1 does not compile on kernel 4.6.0-1 alexsandr1981 May 25, 2016 1:57 AM (in response to gruna) Bug 1278896 - VMware Workstation 12 not starting On Fedora 23REPL:after kernel Topics: Active | Unanswered Index »Applications & Desktop Environments »[SOLVED] VMware modconfig problem Pages: 1 #1 2012-02-05 00:26:25 frmi Member Registered: 2012-02-05 Posts: 22 [SOLVED] VMware modconfig problem Hi,I get an tmick View Public Profile View LQ Blog View Review Entries View HCL Entries Find More Posts by tmick Thread Tools Show Printable Version Email this Page Search this Thread Advanced http://gmailpush.com/failed-to/vmmon-compile-error.html

m odules make[1]: Entering directory `/usr/src/linux-2.6.24.5' CC [M] /tmp/vmware-config1/vmmon-only/linux/driver.o In file included from /tmp/vmware-config1/vmmon-only/./include/vmware.h:25, from /tmp/vmware-config1/vmmon-only/linux/driver.c:48: /tmp/vmware-config1/vmmon-only/./include/vm_basic_types.h:160: error: conflictin g types for 'uintptr_t' include/linux/types.h:40: error: previous declaration of 'uintptr_t' was here Using 2.6.x kernel build system. Works for VMware Workstation 7 installs on 2.6.35 as well. From Brazil!!!ReplyDeleteAdd commentLoad more... http://www.centos.org/forums/viewtopic.php?t=57405

Failed To Build Vmmon. Failed To Execute The Build Command Ubuntu

Zabzoo View Public Profile View LQ Blog View Review Entries View HCL Entries Find More Posts by Zabzoo 11-19-2007, 02:53 PM #3 fakie_flip Senior Member Registered: Feb 2005 Location: Seguici con RSSScrivi sul Forum Collegamenti webTuttoLoginPrivacyGeneratore di password Il tuo IP: 165.231.164.58 Etichette windows xp windows vista windows 7 windows web vsphere vmware vcsa ubuntu tomcat ssl ssh sql I guess I could try the manual dkms setup that the Arch Wiki details, there is also a section that mentions blacklisting kvm, is there any chance that will be causing

Fix, anyone?Could be asked a bit more polite. but does not install on my current system... MODPOST 1 modules WARNING: "putname" [/tmp/modconfig-IFjtiM/vmblock-only/vmblock.ko] undefined! Vthread Failed To Build Vmnet Failed To Execute The Build Command So I found this, and all was going well til I tried to build vmmon and got the following output: sudo make Using kernel build system.

Does the reciprocal of a probability represent anything? Failed To Build Vmnet. Failed To Execute The Build Command. Ubuntu After installing VMware, the following commands patches the vmmon sources: cd /tmp
tar xvf /usr/lib/vmware/modules/source/vmmon.tar -C /tmp
perl -pi -e 's,_range,,' vmmon-only/linux/iommu.c
tar cvf /usr/lib/vmware/modules/source/vmmon.tar vmmon-only
To share|improve this answer answered May 12 '13 at 2:10 notkevin 65736 After doing some additional research, I believe the problem is related to 13.04 removing support for gksu. I checked /var/log/ and apport was reporting the following error: ERROR: apport (pid 3061) Thu Apr 25 08:48:51 2013: executable: /usr/lib/vmware/bin/appLoader (command line "/usr/lib/vmware/bin/vmware-gksu --sudo-mode --message=Please\ enter\ your\ password\ to\ proceed.

There used to be a definition of what VMware considered "unsupported" in that link also but I see they did away with that As far as I could tell the status W115 Failed To Build Vmmon Failed To Execute The Build Command Building the vmmon module. My problem seems to be with building vmmon, either manually like I've referenced in my post or when vmware attempts to do it compilation of vmmon fails with the error I For more information on how to troubleshoot module-related problems, please visit our Web site at "http://www.vmware.com/download/modules/modules.html" and "http://www.vmware.com/support/reference/linux/prebuilt_modules_linux.html".

Failed To Build Vmnet. Failed To Execute The Build Command. Ubuntu

Good luck with the research and the dissertation!Sincerely,John Moore, PhDReplyDeleteCarlos Laurente MurgaSunday, September 19, 2010 at 2:59:00 PM PDTThank you so much!!!! If you know how to read patch files you'll see the user on that form included another change to another file but it all works without me carrying that out. #ifdef Failed To Build Vmmon. Failed To Execute The Build Command Ubuntu By have a better chance for actually getting help. Recipe For Target 'vmmon.ko' Failed This program is going to create it, including needed parent directories.

Why does typography ruin the user experience? How does Energy Field interact with effects that say you lose life? Re: Workstation 12.1 does not compile on kernel 4.6.0-1 dariusd Aug 15, 2016 8:05 PM (in response to PhilAd) The problem is that you've made the same change three times now. Had to add in the version.h link and run the vmware-modconfig command from above, then the install worked. –ubfan1 May 26 '13 at 0:40 add a comment| up vote 1 down Failed To Build Vmnet Centos 6

thanks for a great forum. MODPOST 1 modules WARNING: "putname" [/tmp/modconfig-tGleah/vmblock-only/vmblock.ko] undefined! Using 2.6.x kernel build system. this contact form SUBDIRS=$PWD SRCROOT=$PWD/. \ MODULEBUILDDIR= modules make[1]: Entering directory `/usr/src/linux-3.2.2-1-ARCH' CC [M] /tmp/vmware-root/modules/vmmon-only/linux/driver.o CC [M] /tmp/vmware-root/modules/vmmon-only/linux/iommu.o CC [M] /tmp/vmware-root/modules/vmmon-only/linux/hostif.o CC [M] /tmp/vmware-root/modules/vmmon-only/linux/driverLog.o CC [M] /tmp/vmware-root/modules/vmmon-only/common/memtrack.o CC [M] /tmp/vmware-root/modules/vmmon-only/common/apic.o CC [M] /tmp/vmware-root/modules/vmmon-only/common/cpuid.o CC

Whoohoo!
2016-04-13T07:50:44.215+01:00| vthread-4| I125: found symbol version file /lib/modules/4.5.0-1.el7.elrepo.x86_64/build/Module.symvers
2016-04-13T07:50:44.215+01:00| vthread-4| I125: Reading symbol versions from /lib/modules/4.5.0-1.el7.elrepo.x86_64/build/Module.symvers.
2016-04-13T07:50:44.238+01:00| vthread-4| I125: Read 16630 symbol versions
2016-04-13T07:50:44.238+01:00| vthread-4| I125: Invoking modinfo on "vmmon".
Building the vmmon module.

Now I'm stuck here: Apparently any-any-117a worked for me, even though 117c and 117d did not. Follow the installation instructions https://wiki.archlinux.org/index.php/VM … stallationFor patch use commands under 3.2 kernels and don't forget to install vmware module. Each time you run the command sed -i -e 's/get_user_pages/get_user_pages_remote/g' vmmon-only/linux/hostif.cit adds a "_remote" to the end of every occurrence of "get_user_pages". W115: Failed To Build Vmnet. Failed To Execute The Build Command. Building the vmmon module.

modules make[1]: Entering directory `/usr/src/linux-headers-2.6.24-16-server' CC [M] /tmp/vmware-config0/vmmon-only/linux/driver.o In file included from /tmp/vmware-config0/vmmon-only/./include/vmware.h:25, from /tmp/vmware-config0/vmmon-only/linux/driver.c:48: /tmp/vmware-config0/vmmon-only/./include/vm_basic_types.h:159: error: redefinition of typedef ‘uintptr_t’ include/linux/types.h:40: error: previous declaration of ‘uintptr_t’ was here Much obliged :)ReplyDeleteDingoEmbryoSaturday, October 9, 2010 at 2:34:00 PM PDTI'm just repeating what everyone else said. h:24, from /tmp/vmware-con fig5/vmmon-only /linux/driver.h :15, from /tmp/vmware-config5/vmmon-only/linux/driver.c:53:/tmp/vmware-config5/vmmon-only/./include/x86paging.h:61:1: warning: "PTE_PFN_MASK" redefinedIn file included from /usr/src/linux- headers-2.6.31- 20-generic/arch /x86/include/as m/paravirt.h:7, from /usr/src/linux- headers-2.6.31- 20-generic/arch /x86/include/as m/irqflags.h:61 , from include/linux/i rqflags.h:57, from /usr/src/linux- Trying implicit prerequisite '/tmp/vmware-modules-build/vmnet-only/driver.S_shipped'.

This is very helpful text.ReplyDeletecyberjakFriday, October 15, 2010 at 10:20:00 AM PDTThis got it working. But... Ubuntu 13.04 64bit pst007x@pst007x-Serval-Professional:~$ uname -a Linux pst007x-Serval-Professional 3.9.0-030900-generic #201304291257 SMP Mon Apr 29 16:58:15 UTC 2013 x86_64 x86_64 x86_64 GNU/Linux I have uninstalled and reinstalled all components, but same problem. Not the answer you're looking for?

Please type your message and try again. 1 2 Previous Next 15 Replies Latest reply: Aug 16, 2016 12:38 AM by PhilAd Workstation 12.1 does not compile on kernel 4.6.0-1 gruna h:21, from /tmp/vmware-con fig5/vmmon-only /linux/driver.h :15, from /tmp/vmware-config5/vmmon-only/linux/driver.c:53:/tmp/vmware-config5/vmmon-only/./include/x86apic.h:80:1: warning: "APIC_BASE_MSR" redefinedIn file included from /usr/src/linux- headers-2.6.31- 20-generic/arch /x86/include/as m/apic.h:11, from /usr/src/linux- headers-2.6.31- 20-generic/arch /x86/include/as m/smp.h:13, from /usr/src/linux- headers-2.6.31- 20-generic/arch /x86/include/as m/mmzone_64.h:1 No patch needed/availableUpdating /usr/lib/vmware /bin-debug/vmwa re-vmx ... thanks a million!